AUR Package

FIle bugs here for any of my AUR packages.

https://aur.archlinux.org/packages/?SeB=m&K=sanerb

(NOTE: This is *not* for the scripts at http://git.square-r00t.net/AUR_pkg _bin directory! Please use "AUR_pkg Scripts" for that!)

IDProjectCategoryTask TypeSeveritySummaryStatusProgress
16AUR PackageBackend / CoreBug ReportCritical[phrasendrescher] failure to build with OpenSSL 1.1.0Researching
0%
Task Description

AUR package phrasendrescher fails to build when OpenSSL 1.1.0 is installed because SSL_library_init() was replaced with OPENSSL_init_ssl(). See https://wiki.openssl.org/index.php/Library_Initialization#Autoconf for a potential fix.

 15 AUR PackageBackend / CoreFeature RequestLow mtree-git: provides mtree Closed
100%
Task Description

I'd like to see provides=('mtree') added to PKGBUILD.

BTW, seems this requires some cleanups :)

 13 AUR PackageBackend / CoreBug ReportLow SOLVED: iozone 3_434-4 fails to build Closed
100%
Task Description

Hi,

it was my mistake: I did not merge the 2nd '-z' for LDFLAGS in makepkg.conf after the update to 5.0.2-2.

Sorry.

 12 AUR PackageBackend / CoreBug ReportHigh iozone 3_434-4 fails to build Closed
100%
Task Description

$  makepkg -sL
...

Building the pit_server

cc -c  -march=x86-64 -mtune=generic -O2 -pipe -fstack-protector-strong -fno-plt pit_server.c  -o pit_server.o
cc  -O3 -Wl,-O1,--sort-common,--as-needed,-z,relro,now iozone_linux-AMD64.o libbif.o libasync.o \
    -lrt -lpthread -o iozone
/usr/bin/ld: cannot find now: No such file or directory
collect2: error: ld returned 1 exit status
make: *** [makefile:225: linux-AMD64] Error 1
==> ERROR: A failure occurred in build().
    Aborting...

 6 AUR PackageBackend / CoreBug ReportMedium nquakesv: no default progs, fails on x86_64 Closed
100%
Task Description

By default, running nquakesv errors out with no progs.dat. It might be a good idea to point it to the ktx directory.

Additionally, mvdsv fails on x86_64 builds (see this issue). I can confirm that once the instructions in the issue are followed and mvdsv is installed to /opt/quake everything functions as it should.

 4 AUR PackageBackend / CoreBug ReportMedium Cannot Install mindi-busybox Closed
100%
Task Description

In file included from /usr/include/linux/kernel.h:4:0,
from /usr/include/linux/ethtool.h:16,
from networking/ifenslave.c:109:
/usr/include/linux/sysinfo.h:7:8: error: redefinition of ‘struct sysinfo’
struct sysinfo {
^~~~~~~
In file included from networking/ifenslave.c:101:0:
include/libbb.h:105:8: note: originally defined here
struct sysinfo {
^~~~~~~
make[1]: *** [scripts/Makefile.build:198: networking/ifenslave.o] Error 1
make: *** [Makefile:740: networking] Error 2
==> ERROR: A failure occurred in package().
Aborting...
==> ERROR: Makepkg was unable to build mindi-busybox.
==> Restart building mindi-busybox ? [y/N]

2AUR PackageBackend / CoreBug ReportLow[freeswitch-lite] trim downNew
0%
Task Description

work with co-maintainers to trim-down to a more lightweight build, do some ARM detection, etc.

 1 AUR PackageBackend / CoreBug ReportMedium [fixtar-git] complete pkgbuild Closed
100%
Task Description

currently fixtar-git does not have a functional PKGBUILD. needs to be completed.

Showing tasks 1 - 8 of 8 Page 1 of 1

Available keyboard shortcuts

Tasklist

Task Details

Task Editing