r00t^2_projects::BUGS:: Sun, 13 Aug 2017 09:14:43 +0000 r00t^2_projects::BUGS::AUR Package: Recently closed tasks http://bugs.square-r00t.net/ FS#4: Cannot Install mindi-busybox joe.b.t.lunn@gmail.com Tue, 01 Nov 2016 23:33:39 +0000 In file included from /usr/include/linux/kernel.h:4:0,
from /usr/include/linux/ethtool.h:16,
from networking/ifenslave.c:109:
/usr/include/linux/sysinfo.h:7:8: error: redefinition of ‘struct sysinfo’
struct sysinfo {
^~~~~~~
In file included from networking/ifenslave.c:101:0:
include/libbb.h:105:8: note: originally defined here
struct sysinfo {
^~~~~~~
make[1]: *** [scripts/Makefile.build:198: networking/ifenslave.o] Error 1
make: *** [Makefile:740: networking] Error 2
==> ERROR: A failure occurred in package().
Aborting...
==> ERROR: Makepkg was unable to build mindi-busybox.
==> Restart building mindi-busybox ? [y/N]

]]>
http://bugs.square-r00t.net/index.php?do=details&task_id=4 http://bugs.square-r00t.net/index.php?do=details&task_id=4
FS#12: iozone 3_434-4 fails to build h.lekin@gmx.net Tue, 18 Jul 2017 12:50:01 +0000 $  makepkg -sL
...

Building the pit_server

cc -c  -march=x86-64 -mtune=generic -O2 -pipe -fstack-protector-strong -fno-plt pit_server.c  -o pit_server.o
cc  -O3 -Wl,-O1,--sort-common,--as-needed,-z,relro,now iozone_linux-AMD64.o libbif.o libasync.o \
    -lrt -lpthread -o iozone
/usr/bin/ld: cannot find now: No such file or directory
collect2: error: ld returned 1 exit status
make: *** [makefile:225: linux-AMD64] Error 1
==> ERROR: A failure occurred in build().
    Aborting...

]]>
http://bugs.square-r00t.net/index.php?do=details&task_id=12 http://bugs.square-r00t.net/index.php?do=details&task_id=12
FS#13: SOLVED: iozone 3_434-4 fails to build h.lekin@gmx.net Tue, 18 Jul 2017 13:38:28 +0000 Hi,

it was my mistake: I did not merge the 2nd '-z' for LDFLAGS in makepkg.conf after the update to 5.0.2-2.

Sorry.

]]>
http://bugs.square-r00t.net/index.php?do=details&task_id=13 http://bugs.square-r00t.net/index.php?do=details&task_id=13
FS#6: nquakesv: no default progs, fails on x86_64 cormac@c-obrien.org Thu, 12 Jan 2017 01:07:06 +0000 By default, running nquakesv errors out with no progs.dat. It might be a good idea to point it to the ktx directory.

Additionally, mvdsv fails on x86_64 builds (see this issue). I can confirm that once the instructions in the issue are followed and mvdsv is installed to /opt/quake everything functions as it should.

]]>
http://bugs.square-r00t.net/index.php?do=details&task_id=6 http://bugs.square-r00t.net/index.php?do=details&task_id=6
FS#1: [fixtar-git] complete pkgbuild brent s. Sun, 26 Jun 2016 04:35:57 +0000 currently fixtar-git does not have a functional PKGBUILD. needs to be completed.

]]>
http://bugs.square-r00t.net/index.php?do=details&task_id=1 http://bugs.square-r00t.net/index.php?do=details&task_id=1