r00t^2_projects::BUGS:: https://bugs.square-r00t.net/ r00t^2_projects::BUGS::AUR Package: Recently opened tasks 2017-11-21T18:28:04Z FS#16: [phrasendrescher] failure to build with OpenSSL 1.1.0 https://bugs.square-r00t.net/index.php?do=details&task_id=16 2017-11-21T18:28:04Z anonymous AUR package phrasendrescher fails to build when OpenSSL 1.1.0 is installed because SSL_library_init() was replaced with OPENSSL_init_ssl(). See https://wiki.openssl.org/index.php/Library_Initialization#Autoconf for a potential fix. AUR package phrasendrescher fails to build when OpenSSL 1.1.0 is installed because SSL_library_init() was replaced with OPENSSL_init_ssl(). See https://wiki.openssl.org/index.php/Library_Initialization#Autoconf for a potential fix.

]]>
FS#15: mtree-git: provides mtree https://bugs.square-r00t.net/index.php?do=details&task_id=15 2017-11-09T15:06:15Z anonymous I'd like to see provides=('mtree') added to PKGBUILD. BTW, seems this requires some cleanups :) I'd like to see provides=('mtree') added to PKGBUILD.

BTW, seems this requires some cleanups :)

]]>
FS#13: SOLVED: iozone 3_434-4 fails to build https://bugs.square-r00t.net/index.php?do=details&task_id=13 2017-08-13T09:13:41Z anonymous Hi, it was my mistake: I did not merge the 2nd '-z' for LDFLAGS in makepkg.conf after the update to 5.0.2-2. Sorry. Hi,

it was my mistake: I did not merge the 2nd '-z' for LDFLAGS in makepkg.conf after the update to 5.0.2-2.

Sorry.

]]>
FS#12: iozone 3_434-4 fails to build https://bugs.square-r00t.net/index.php?do=details&task_id=12 2017-08-13T09:14:03Z anonymous $  makepkg -sL ... Building the pit_server cc -c  -march=x86-64 -mtune=generic -O2 -pipe -fstack-protector-strong -fno-plt pit_server.c  -o pit_server.o cc  -O3 -Wl,-O1,--sort-common,--as-needed,-z,relro,now iozone_linux-AMD64.o libbif.o libasync.o \     -lrt -lpthread -o iozone /usr/bin/ld: cannot find now: No such file or directory collect2: error: ld returned 1 exit status make: *** [makefile:225: linux-AMD64] Error 1 ==> ERROR: A failure occurred in build().     Aborting... $  makepkg -sL
...

Building the pit_server

cc -c  -march=x86-64 -mtune=generic -O2 -pipe -fstack-protector-strong -fno-plt pit_server.c  -o pit_server.o
cc  -O3 -Wl,-O1,--sort-common,--as-needed,-z,relro,now iozone_linux-AMD64.o libbif.o libasync.o \
    -lrt -lpthread -o iozone
/usr/bin/ld: cannot find now: No such file or directory
collect2: error: ld returned 1 exit status
make: *** [makefile:225: linux-AMD64] Error 1
==> ERROR: A failure occurred in build().
    Aborting...

]]>
FS#6: nquakesv: no default progs, fails on x86_64 https://bugs.square-r00t.net/index.php?do=details&task_id=6 2017-04-14T23:14:14Z anonymous By default, running nquakesv errors out with no progs.dat. It might be a good idea to point it to the ktx directory. Additionally, mvdsv fails on x86_64 builds (see this issue). I can confirm that once the instructions in the issue are followed and mvdsv is installed to /opt/quake everything functions as it should. By default, running nquakesv errors out with no progs.dat. It might be a good idea to point it to the ktx directory.

Additionally, mvdsv fails on x86_64 builds (see this issue). I can confirm that once the instructions in the issue are followed and mvdsv is installed to /opt/quake everything functions as it should.

]]>
FS#4: Cannot Install mindi-busybox https://bugs.square-r00t.net/index.php?do=details&task_id=4 2017-08-13T09:14:43Z anonymous In file included from /usr/include/linux/kernel.h:4:0, from /usr/include/linux/ethtool.h:16, from networking/ifenslave.c:109: /usr/include/linux/sysinfo.h:7:8: error: redefinition of ‘struct sysinfo’ struct sysinfo { ^~~~~~~ In file included from networking/ifenslave.c:101:0: include/libbb.h:105:8: note: originally defined here struct sysinfo { ^~~~~~~ make[1]: *** [scripts/Makefile.build:198: networking/ifenslave.o] Error 1 make: *** [Makefile:740: networking] Error 2 ==> ERROR: A failure occurred in package(). Aborting... ==> ERROR: Makepkg was unable to build mindi-busybox. ==> Restart building mindi-busybox ? [y/N] In file included from /usr/include/linux/kernel.h:4:0,
from /usr/include/linux/ethtool.h:16,
from networking/ifenslave.c:109:
/usr/include/linux/sysinfo.h:7:8: error: redefinition of ‘struct sysinfo’
struct sysinfo {
^~~~~~~
In file included from networking/ifenslave.c:101:0:
include/libbb.h:105:8: note: originally defined here
struct sysinfo {
^~~~~~~
make[1]: *** [scripts/Makefile.build:198: networking/ifenslave.o] Error 1
make: *** [Makefile:740: networking] Error 2
==> ERROR: A failure occurred in package().
Aborting...
==> ERROR: Makepkg was unable to build mindi-busybox.
==> Restart building mindi-busybox ? [y/N]

]]>
FS#2: [freeswitch-lite] trim down https://bugs.square-r00t.net/index.php?do=details&task_id=2 2016-06-26T04:41:07Z brent s. work with co-maintainers to trim-down to a more lightweight build, do some ARM detection, etc. work with co-maintainers to trim-down to a more lightweight build, do some ARM detection, etc.

]]>
FS#1: [fixtar-git] complete pkgbuild https://bugs.square-r00t.net/index.php?do=details&task_id=1 2016-11-21T08:30:04Z brent s. currently fixtar-git does not have a functional PKGBUILD. needs to be completed. currently fixtar-git does not have a functional PKGBUILD. needs to be completed.

]]>