r00t^2_projects::BUGS:: r00t^2_projects::BUGS::AUR Package: Recently opened tasks https://bugs.square-r00t.net/ 2017-08-16T18:57:26Z FS#14: SameFileError 2017-08-16T18:57:26Z 2017-08-16T18:57:26Z

found error while running aif

  File "/usr/lib/python3.6/shutil.py", line 257, in copy2

    copyfile(src,dst,follow_symlinks=follow_symlinks)

  File "/usr/lib/python3.6/shutil.py", line 104, in copyfile

    raise SameFileError("{!r} and {!r} are the same file".format(src, dist))

shutil.SameFileError: '/mnt/boot/vmlinuz-linux' and '/mnt/boot/vmlinuz-llinux'

jckimble601@gmail.com https://bugs.square-r00t.net/:14
FS#13: SOLVED: iozone 3_434-4 fails to build 2017-08-13T09:13:41Z 2017-07-18T13:38:28Z

Hi,

it was my mistake: I did not merge the 2nd '-z' for LDFLAGS in makepkg.conf after the update to 5.0.2-2.

Sorry.

h.lekin@gmx.net https://bugs.square-r00t.net/:13
FS#12: iozone 3_434-4 fails to build 2017-08-13T09:14:03Z 2017-07-18T12:50:01Z

$  makepkg -sL
...

Building the pit_server

cc -c  -march=x86-64 -mtune=generic -O2 -pipe -fstack-protector-strong -fno-plt pit_server.c  -o pit_server.o
cc  -O3 -Wl,-O1,--sort-common,--as-needed,-z,relro,now iozone_linux-AMD64.o libbif.o libasync.o \
    -lrt -lpthread -o iozone
/usr/bin/ld: cannot find now: No such file or directory
collect2: error: ld returned 1 exit status
make: *** [makefile:225: linux-AMD64] Error 1
==> ERROR: A failure occurred in build().
    Aborting...

h.lekin@gmx.net https://bugs.square-r00t.net/:12
FS#6: nquakesv: no default progs, fails on x86_64 2017-04-14T23:14:14Z 2017-01-12T01:07:06Z

By default, running nquakesv errors out with no progs.dat. It might be a good idea to point it to the ktx directory.

Additionally, mvdsv fails on x86_64 builds (see this issue). I can confirm that once the instructions in the issue are followed and mvdsv is installed to /opt/quake everything functions as it should.

cormac@c-obrien.org https://bugs.square-r00t.net/:6
FS#4: Cannot Install mindi-busybox 2017-08-13T09:14:43Z 2016-11-01T23:33:39Z

In file included from /usr/include/linux/kernel.h:4:0,
from /usr/include/linux/ethtool.h:16,
from networking/ifenslave.c:109:
/usr/include/linux/sysinfo.h:7:8: error: redefinition of ‘struct sysinfo’
struct sysinfo {
^~~~~~~
In file included from networking/ifenslave.c:101:0:
include/libbb.h:105:8: note: originally defined here
struct sysinfo {
^~~~~~~
make[1]: *** [scripts/Makefile.build:198: networking/ifenslave.o] Error 1
make: *** [Makefile:740: networking] Error 2
==> ERROR: A failure occurred in package().
Aborting...
==> ERROR: Makepkg was unable to build mindi-busybox.
==> Restart building mindi-busybox ? [y/N]

joe.b.t.lunn@gmail.com https://bugs.square-r00t.net/:4
FS#2: [freeswitch-lite] trim down 2016-06-26T04:41:07Z 2016-06-26T04:41:07Z

work with co-maintainers to trim-down to a more lightweight build, do some ARM detection, etc.

brent s. https://bugs.square-r00t.net/:2
FS#1: [fixtar-git] complete pkgbuild 2016-11-21T08:30:04Z 2016-06-26T04:35:57Z

currently fixtar-git does not have a functional PKGBUILD. needs to be completed.

brent s. https://bugs.square-r00t.net/:1